{"text_format":"1","workbook":"xlsx","n_sheets":9,"sheets":["Informasjonsside","Grønn mobilitet","Gjenbruk og materialvalg","Energiløsninger","Arealbruk","Prosjektets blåhvite faktor","Beregningsunderlag","Vekting","Kriterier og poengskala"],"not_rendered":{"charts":17,"images":3,"macros":1,"external_links":0,"defined_names":84,"comments":0,"pivot_tables":0},"unopened":[],"bounds":{"document_bytes":16777216,"sheet_cells":100000,"rows_first":2000,"rows_last":500,"rows_between":2000,"halvings":0,"cell_chars":16384,"cell_head_chars":4096},"cells_cut":0,"cells_raw":0,"read":"whole","date_system":"1900"}

{"sheet":"Informasjonsside","index":0,"n_rows":68,"n_cols":7,"rows_kept":68,"cut":false,"hidden":false,"merged":[[67,1,75,9],[11,1,30,9],[39,1,50,9]]}
[null,"Sist oppdatert: 19.10.2023"]
[null,"Verktøy og veileder utarbeidet av"]
[]
[]
[]
[]
[null,"Informasjonsside"]
[]
[]
[]
[]
[null,"Blåhvit faktor er Gjøvik kommune sitt klimaverktøy for å vurdere klima opp mot saksbehandlingsprosesser, lokale forhold og kommunalt planverk. Verktøyet består av en veileder og beregningsmodell, hvorav sistnevnte er et tilleggsverktøy for å lettere følge opp klimahensyn i saksbehandling. \n\nBeregningsmodellen er tiltenkt som et praktisk verktøy som er enkelt å bruke i forbindelser med vurdering av klima- og miljøvennlig arealplanlegging og byggesaksbehandling. Veilederen og beregningsmodellen skal sammen være et verktøy for arealplanleggere, byggesaksavdelingen og utbyggere i kommunen. Målet med beregningsmodellen er å synliggjøre hvilke tiltak som gir innfrielse av kommunens klima- og miljøkrav, beskrevet i detalj i veilederen.\n\nVeilederen og beregningsmodellen skal sammen legge til rette for at det implementeres gode klima og miljøløsninger i hvert enkelt prosjekt, og er beregnet til bruk i større utbyggingsprosjekt. Blåhvit faktor verktøyet skal kvantifisere klimatiltak i byggesaker og dermed gi grunnlag for en forutsigbar innfrielse av kommunens klima- og miljøkrav.\n\nVekting av hver kategori er vist i figuren til høyre og bakgrunn for vekting for kriteriene innad kategoriene er beskrevet i detalj i veilederen. Enkelte kriterier har splittet skala for eksisterende og nye bygg, og poengutslag baseres på inndata som legges til grunn."]
[]
[]
[]
[]
[]
[]
[]
[]
{"$rows_left_out":49}
{"sheet":"Grønn mobilitet","index":1,"n_rows":58,"n_cols":19,"rows_kept":58,"cut":false,"hidden":false,"merged":[[38,16,38,19],[39,16,39,19],[40,16,40,19],[23,2,23,5],[24,2,24,5],[25,2,25,5],[26,2,26,5],[27,16,27,18],[27,9,27,13],[26,16,26,17],[23,16,23,19],[24,16,24,19],[25,16,25,19],[23,9,23,13],[24,9,24,13],[25,9,25,13],[26,9,26,13],[42,2,42,6],[41,9,41,13],[42,9,42,13],[38,9,38,12],[39,9,39,12],[40,9,40,12],[38,2,38,6],[39,2,39,6],[40,2,40,6],[41,2,41,6]]}
[]
[]
[null,"Grønn mobilitet"]
[]
[]
[]
[null,"Beskrivelse av hensikt"]
[null,"[Sett inn tekst fra introen til kriteriesettet for Grønn mobilitet.]"]
[]
[]
[]
[]
[]
[]
[]
[]
[]
[]
[]
[null,"Kriterie 1",{"$f":"Beregningsunderlag!D29","v":"Økt etablering av ladeinfrastruktur"},null,null,null,null,null,"Kriterie 2",{"$f":"Beregningsunderlag!D30","v":"Gangevennlig utforming"},null,null,null,null,null,"Kriterie 3",{"$f":"Beregningsunderlag!D31","v":"Sykkelvennlig utforming"}]
{"$rows_left_out":39}
{"sheet":"Gjenbruk og materialvalg","index":2,"n_rows":43,"n_cols":19,"rows_kept":43,"cut":false,"hidden":false,"merged":[[27,16,27,19],[26,16,26,19],[23,2,23,6],[24,2,24,6],[25,2,25,6],[26,2,26,6],[27,2,27,6],[23,16,23,20],[24,16,24,20],[25,16,25,20]]}
[]
[]
[null,"Gjenbruk og materialvalg"]
[]
[]
[]
[null,"Beskrivelse av hensikt"]
[null,"[Sett inn tekst fra introen til kriteriesettet for Materialer.]"]
[]
[]
[]
[]
[]
[]
[]
[]
[]
[]
[]
[null,"Kriterie 1",{"$f":"Beregningsunderlag!D40","v":"Bygg på bærekraftige og fornybare materialvalg"},null,null,null,null,null,"Kriterie 2",{"$f":"Beregningsunderlag!D41","v":"Sirkulære og fleksible bygg"},null,null,null,null,null,"Kriterie 3",{"$f":"Beregningsunderlag!D42","v":"Ombruk av materialer og bevaring av eksisterende bygg"}]
{"$rows_left_out":24}
{"sheet":"Energiløsninger","index":3,"n_rows":43,"n_cols":19,"rows_kept":43,"cut":false,"hidden":false,"merged":[[23,2,23,6],[24,2,24,6],[25,2,25,6],[26,2,26,6],[27,2,27,6],[39,2,39,6],[40,2,40,6],[42,2,42,5],[41,2,41,5],[27,16,27,20],[34,2,34,5],[38,2,38,5],[27,9,27,13],[23,16,23,19],[23,9,23,13],[24,9,24,13],[25,9,25,13],[26,9,26,13],[24,16,24,19],[25,16,25,19],[26,16,26,19]]}
[]
[]
[null,"Energiløsninger"]
[]
[]
[]
[null,"Beskrivelse av hensikt"]
[null,"[Sett inn tekst fra introen til kriteriesettet for Energi.]"]
[]
[]
[]
[]
[]
[]
[]
[]
[]
[]
[]
[null,"Kriterie 1",{"$f":"Beregningsunderlag!D49","v":"Energiytelser i driftsfase av bygg - Nybygg"},null,null,null,null,null,"Kriterie 1",{"$f":"Beregningsunderlag!D50","v":"Energiytelser i driftsfase av bygg - Eksisterende bygg"},null,null,null,null,null,"Kriterie 2",{"$f":"Beregningsunderlag!D51","v":"Lokal fornybar energiproduksjon"}]
{"$rows_left_out":24}
{"sheet":"Arealbruk","index":4,"n_rows":58,"n_cols":19,"rows_kept":58,"cut":false,"hidden":false,"merged":[[53,9,53,13],[54,9,54,13],[55,9,55,13],[56,9,56,13],[48,2,49,6],[48,9,49,13],[53,2,53,6],[54,2,54,6],[55,2,55,6],[56,2,56,6],[19,2,19,6],[19,9,19,13],[34,9,34,13],[34,16,34,20],[23,2,23,6],[23,9,23,13],[24,2,24,6],[25,2,25,6],[26,2,26,6],[27,2,27,6],[23,16,23,20],[24,16,24,20],[25,16,25,20],[26,16,26,20],[38,2,38,5],[39,2,39,5],[40,2,40,5],[41,2,41,5],[42,2,42,5],[41,16,41,19],[44,8,45,13],[27,16,27,19],[38,9,38,13],[39,9,39,13],[40,9,40,13],[41,9,41,13],[42,9,42,13]]}
[]
[]
[null,"Arealbruk"]
[]
[]
[]
[null,"Beskrivelse av hensikt"]
[null,"[Sett inn tekst fra introen til kriteriesettet for Arealbruk, hvorfor klimatilpasning er satt her samt overvannshåndtering og blågrønn faktor?.]"]
[]
[]
[]
[]
[]
[]
[]
[]
[]
[]
[]
[null,"Kriterie 1",{"$f":"Beregningsunderlag!D58","v":"Attraktive uteområder med blågrønne strukturer"},null,null,null,null,null,"Kriterie 2",{"$f":"Beregningsunderlag!D59","v":"Bevaring av viktig grønnstruktur og karbonrike areal"},null,null,null,null,null,"Kriterie 3",{"$f":"Beregningsunderlag!D60","v":"Etablering av karbonbindende vegetasjon"}]
{"$rows_left_out":39}
{"sheet":"Prosjektets blåhvite faktor","index":5,"n_rows":51,"n_cols":6,"rows_kept":51,"cut":false,"hidden":false,"merged":[]}
[]
[]
[null,"Prosjektets blåhvite faktor"]
[]
[]
[]
[]
[]
[]
[null,"Oppsummering av kriteriekategoriene"]
[]
[null,null,"Energiløsninger"]
[null,null,{"$f":"Energi_T1.1_Nybygg","v":0},"Energiytelser i driftsfase av bygg - Nybygg"]
[null,null,{"$f":"Energi_T1.2_EksBygg","v":0},"Energiytelser i driftsfase av bygg - Eksisterende bygg"]
[null,null,{"$f":"Energi_T2","v":0},"Lokal fornybar energiproduksjon"]
[null,null,{"$f":"Energi_T3","v":0},"Lav og nullutslippsteknologi i bygg- og anleggsfase"]
[null,null,{"$f":"Energi_T4","v":0},"Innovasjonspoeng for energiløsninger"]
[null,{"$f":"Energi_KatPoeng","v":0}]
[]
[]
{"$rows_left_out":32}
{"sheet":"Beregningsunderlag","index":6,"n_rows":66,"n_cols":17,"rows_kept":66,"cut":false,"hidden":true,"merged":[]}
[]
[]
[null,"Beregningsunderlag"]
[]
[]
[]
[]
[]
[]
[null,"Vekting"]
[]
[null,null,"Kategori","Vektingsprosent","Poeng (vises)","Oppnåelse %","Kategoripoeng","Til figur","Oppnåelse 2019"]
[null,null,"Grønn mobilitet",0.25,{"$f":"GrønnMobilitet[[#Totals],[Kategoripoeng]]","v":0},{"$f":"(Vekting1[[#This Row],[Poeng (vises)]]/4)*Vekting1[[#This Row],[Vektingsprosent]]","v":0},{"$f":"GrønnMobilitet[[#Totals],[Kategoripoeng]]","v":0},{"$f":"$E$20-Vekting1[[#This Row],[Kategoripoeng]]","v":4},{"$f":"INDEX(Vekting1[[Vektingsprosent]:[Kategoripoeng]],MATCH(Vekting!C74,Vekting1[Kategori],0),MATCH(\"Oppnåelse %\",Vekting1[[#Headers],[Vektingsprosent]:[Kategoripoeng]],0))","v":0}]
[null,null,"Gjenbruk og materialvalg",0.2,{"$f":"GjenbrukMaterialvalg[[#Totals],[Kategoripoeng]]","v":0},{"$f":"(Vekting1[[#This Row],[Poeng (vises)]]/4)*Vekting1[[#This Row],[Vektingsprosent]]","v":0},{"$f":"GjenbrukMaterialvalg[[#Totals],[Kategoripoeng]]","v":0},{"$f":"$E$20-Vekting1[[#This Row],[Kategoripoeng]]","v":4},{"$f":"INDEX(Vekting1[[Vektingsprosent]:[Kategoripoeng]],MATCH(Vekting!C72,Vekting1[Kategori],0),MATCH(\"Oppnåelse %\",Vekting1[[#Headers],[Vektingsprosent]:[Kategoripoeng]],0))","v":0}]
[null,null,"Energiløsninger",0.2,{"$f":"Energi[[#Totals],[Kategoripoeng]]","v":0},{"$f":"(Vekting1[[#This Row],[Poeng (vises)]]/4)*Vekting1[[#This Row],[Vektingsprosent]]","v":0},{"$f":"Energi[[#Totals],[Kategoripoeng]]","v":0},{"$f":"$E$20-Vekting1[[#This Row],[Kategoripoeng]]","v":4},{"$f":"INDEX(Vekting1[[Vektingsprosent]:[Kategoripoeng]],MATCH(Vekting!C70,Vekting1[Kategori],0),MATCH(\"Oppnåelse %\",Vekting1[[#Headers],[Vektingsprosent]:[Kategoripoeng]],0))","v":0}]
[null,null,"Arealbruk",0.35,{"$f":"Arealbruk[[#Totals],[Kategoripoeng]]","v":0},{"$f":"(Vekting1[[#This Row],[Poeng (vises)]]/4)*Vekting1[[#This Row],[Vektingsprosent]]","v":0},{"$f":"Arealbruk[[#Totals],[Kategoripoeng]]","v":0},{"$f":"$E$20-Vekting1[[#This Row],[Kategoripoeng]]","v":4},{"$f":"INDEX(Vekting1[[Vektingsprosent]:[Kategoripoeng]],MATCH(Vekting!C68,Vekting1[Kategori],0),MATCH(\"Oppnåelse %\",Vekting1[[#Headers],[Vektingsprosent]:[Kategoripoeng]],0))","v":0}]
[null,null,"Totalt",{"$f":"SUBTOTAL(109,Vekting1[Vektingsprosent])","v":1},{"$f":"SUBTOTAL(101,Vekting1[Poeng (vises)])","v":0},{"$f":"SUBTOTAL(109,Vekting1[Oppnåelse %])","v":0},{"$f":"SUBTOTAL(109,Vekting1[Kategoripoeng])","v":0}]
[]
[]
[null,null,null,"Maksimalt poeng tilgjengelig per kriterie:",4]
{"$rows_left_out":47}
{"sheet":"Vekting","index":7,"n_rows":75,"n_cols":7,"rows_kept":75,"cut":false,"hidden":true,"merged":[]}
[]
[]
[null,"Vektingen i blåhvit faktor"]
[]
[]
[]
[]
[]
[null,"Vekting av klimakriterier (per kategori og totalt sett)"]
[]
[]
[null,"Vekting","Kategori","Klimakriterie per kategori","Vekting innen kategori","Vekting totalt (100%)"]
[null,{"$f":"INDEX(Vekting1[[Vektingsprosent]:[Kategoripoeng]],MATCH($C$13,Vekting1[Kategori],0),MATCH(\"Vektingsprosent\",Vekting1[[#Headers],[Vektingsprosent]:[Kategoripoeng]],0))","v":0.25},"Grønn mobilitet","Økt etablering av ladeinfrastruktur",{"$f":"INDEX(GrønnMobilitet[[Poeng]:[Blåhvit faktor]],MATCH(Vekting!D13,GrønnMobilitet[Kriterie],0),MATCH(GrønnMobilitet[[#Headers],[Vekting]],GrønnMobilitet[[#Headers],[Poeng]:[Blåhvit faktor]],0))","v":0.08},{"$f":"INDEX(Vekting1[[Vektingsprosent]:[Kategoripoeng]],MATCH($C$13,Vekting1[Kategori],0),MATCH(\"Vektingsprosent\",Vekting1[[#Headers],[Vektingsprosent]:[Kategoripoeng]],0))*E13","v":0.02},{"$f":"IF(SUMIFS($F$13:$F$35,$C$13:$C$35,C13)=$B13,\"Vekting for kategorien er OK!\",\"Sjekk opp\")","v":"Vekting for kategorien er OK!"}]
[null,null,"Grønn mobilitet","Gangevennlig utforming",{"$f":"INDEX(GrønnMobilitet[[Poeng]:[Blåhvit faktor]],MATCH(Vekting!D14,GrønnMobilitet[Kriterie],0),MATCH(GrønnMobilitet[[#Headers],[Vekting]],GrønnMobilitet[[#Headers],[Poeng]:[Blåhvit faktor]],0))","v":0.1},{"$f":"INDEX(Vekting1[[Vektingsprosent]:[Kategoripoeng]],MATCH($C$13,Vekting1[Kategori],0),MATCH(\"Vektingsprosent\",Vekting1[[#Headers],[Vektingsprosent]:[Kategoripoeng]],0))*E14","v":2.5000000000000001E-2}]
[null,null,"Grønn mobilitet","Sykkelvennlig utforming",{"$f":"INDEX(GrønnMobilitet[[Poeng]:[Blåhvit faktor]],MATCH(Vekting!D15,GrønnMobilitet[Kriterie],0),MATCH(GrønnMobilitet[[#Headers],[Vekting]],GrønnMobilitet[[#Headers],[Poeng]:[Blåhvit faktor]],0))","v":0.15},{"$f":"INDEX(Vekting1[[Vektingsprosent]:[Kategoripoeng]],MATCH($C$13,Vekting1[Kategori],0),MATCH(\"Vektingsprosent\",Vekting1[[#Headers],[Vektingsprosent]:[Kategoripoeng]],0))*E15","v":3.7499999999999999E-2}]
[null,null,"Grønn mobilitet","Klimasmart parkering",{"$f":"INDEX(GrønnMobilitet[[Poeng]:[Blåhvit faktor]],MATCH(Vekting!D16,GrønnMobilitet[Kriterie],0),MATCH(GrønnMobilitet[[#Headers],[Vekting]],GrønnMobilitet[[#Headers],[Poeng]:[Blåhvit faktor]],0))","v":0.25},{"$f":"INDEX(Vekting1[[Vektingsprosent]:[Kategoripoeng]],MATCH($C$13,Vekting1[Kategori],0),MATCH(\"Vektingsprosent\",Vekting1[[#Headers],[Vektingsprosent]:[Kategoripoeng]],0))*E16","v":6.25E-2}]
[null,null,"Grønn mobilitet","Tilgang til service- og rekreasjonstilbud",{"$f":"INDEX(GrønnMobilitet[[Poeng]:[Blåhvit faktor]],MATCH(Vekting!D17,GrønnMobilitet[Kriterie],0),MATCH(GrønnMobilitet[[#Headers],[Vekting]],GrønnMobilitet[[#Headers],[Poeng]:[Blåhvit faktor]],0))","v":0.15},{"$f":"INDEX(Vekting1[[Vektingsprosent]:[Kategoripoeng]],MATCH($C$13,Vekting1[Kategori],0),MATCH(\"Vektingsprosent\",Vekting1[[#Headers],[Vektingsprosent]:[Kategoripoeng]],0))*E17","v":3.7499999999999999E-2}]
[null,null,"Grønn mobilitet","Nærhet til kollektivtransport",{"$f":"INDEX(GrønnMobilitet[[Poeng]:[Blåhvit faktor]],MATCH(Vekting!D18,GrønnMobilitet[Kriterie],0),MATCH(GrønnMobilitet[[#Headers],[Vekting]],GrønnMobilitet[[#Headers],[Poeng]:[Blåhvit faktor]],0))","v":0.2},{"$f":"INDEX(Vekting1[[Vektingsprosent]:[Kategoripoeng]],MATCH($C$13,Vekting1[Kategori],0),MATCH(\"Vektingsprosent\",Vekting1[[#Headers],[Vektingsprosent]:[Kategoripoeng]],0))*E18","v":0.05}]
[null,null,"Grønn mobilitet","Innovasjonspoeng for grønn mobilitet",{"$f":"INDEX(GrønnMobilitet[[Poeng]:[Blåhvit faktor]],MATCH(Vekting!D19,GrønnMobilitet[Kriterie],0),MATCH(GrønnMobilitet[[#Headers],[Vekting]],GrønnMobilitet[[#Headers],[Poeng]:[Blåhvit faktor]],0))","v":7.0000000000000007E-2},{"$f":"INDEX(Vekting1[[Vektingsprosent]:[Kategoripoeng]],MATCH($C$13,Vekting1[Kategori],0),MATCH(\"Vektingsprosent\",Vekting1[[#Headers],[Vektingsprosent]:[Kategoripoeng]],0))*E19","v":1.7500000000000002E-2}]
[null,{"$f":"INDEX(Vekting1[[Vektingsprosent]:[Kategoripoeng]],MATCH($C$20,Vekting1[Kategori],0),MATCH(\"Vektingsprosent\",Vekting1[[#Headers],[Vektingsprosent]:[Kategoripoeng]],0))","v":0.2},"Gjenbruk og materialvalg","Bygg på bærekraftige og fornybare materialvalg",{"$f":"INDEX(GjenbrukMaterialvalg[[Poeng]:[Blåhvit faktor]],MATCH(Vekting!D20,GjenbrukMaterialvalg[Kriterie],0),MATCH(GjenbrukMaterialvalg[[#Headers],[Vekting]],GjenbrukMaterialvalg[[#Headers],[Poeng]:[Blåhvit faktor]],0))","v":0.35},{"$f":"INDEX(Vekting1[[Vektingsprosent]:[Kategoripoeng]],MATCH($C$20,Vekting1[Kategori],0),MATCH(\"Vektingsprosent\",Vekting1[[#Headers],[Vektingsprosent]:[Kategoripoeng]],0))*E20","v":6.9999999999999993E-2},{"$f":"IF(SUMIFS($F$13:$F$35,$C$13:$C$35,C20)=$B20,\"Vekting for kategorien er OK!\",\"Sjekk opp\")","v":"Vekting for kategorien er OK!"}]
{"$rows_left_out":56}
{"sheet":"Kriterier og poengskala","index":8,"n_rows":34,"n_cols":9,"rows_kept":34,"cut":false,"hidden":true,"merged":[[10,1,16,1],[17,1,21,1],[26,1,33,1],[22,1,25,1]]}
[]
[]
[null,"Kriteriesett i blåhvit faktor"]
[]
[]
[]
[]
[]
[]
[null,null,"Kriterienavn",0,1,2,3,4]
[null,"Grønn mobilitet","Økt etablering av ladeinfrastruktur","Ingen ladeinfrastruktur","> 20% av prosjektets totale bilparkeringskapasitet er forbeholdt å ha ladepunkt for el-bil","> 30% av prosjektets totale bilparkeringskapasitet er forbeholdt å ha ladepunkt for el-bil","> 40% av prosjektets totale bilparkeringskapasitet er forbeholdt å ha ladepunkt for el-bil","> 55% av prosjektets totale bilparkeringskapasitet er forbeholdt å ha ladepunkt for el-bil"]
[null,null,"Gangevennlig utforming","Ikke universelt utformet og/eller det er mer enn 70 meter avstand til nærmeste gangforbindelse","Gangnettet er utformet med tanke på trygghet, sikkerhet, komfort med tilstrekkelig belysning og tilrettelagt for vedlikehold året rundt. ","Som 1 poeng, og i tillegg er 1-5 på sjekklisten oppfylt","Som 1 poeng, og i tillegg er 1-6 i sjekklisten oppfylt","Som 1 poeng, og i tillegg er alle punkter i sjekklisten oppfylt"]
[null,null,"Sykkelvennlig utforming","Tilfredsstiller ikke krav i KPA","Krav i KPA er oppfylt","Krav i KPA er oppfylt, i tillegg er punkt 1-6 i sjekklisten for utforming av sykkelparkering oppfylt","Krav i KPA er oppfylt, i tillegg er punkt 1-7 i sjekklisten for utforming av sykkelparkering oppfylt","Krav i KPA er oppfylt, i tillegg er alle punkt  i sjekklisten for utforming av sykkelparkering oppfylt"]
[null,null,"Klimasmart parkering","Parkeringsdekning utover makskravet i KPA","Parkeringsdekning tilsvarer maksimumskravet i KPA. ","Parkeringsdekning tilsvarer minimumskravet i KPA","Som for 2 poeng, og i tillegg er det parkeringsplasser som er forbeholdt samkjøring / tilrettelagt for bildeling","Som for 3 poeng, og i tillegg er det kortere avstand til kollektivknutepunkt enn til privat/reservert parkering. "]
[null,null,"Tilgang til service- og rekreasjonstilbud","Ingen tilbud innenfor gåavstand fra boliger","Mer enn 3 ulike tilbud innenfor gåavstand","Mer enn 3 ulike tilbud innenfor gåavstand, hvorav 1 av tilbudene skal være skole eller barnehage","Mer enn 5 ulike tilbud innenfor gåavstand, hvorav 1 av tilbudene skal være skole eller barnehage","Mer enn 7 ulike tilbud innenfor gåavstand, hvorav 1 av tilbudene skal være skole eller barnehage"]
[null,null,"Nærhet til kollektivtransport","Mer enn 1000 meter til kollektivholdeplass","Mer enn 500 meter til kollektivholdeplass","Mindre enn 500 meter til kollektivholdsplass \nmed minst 1 avgang per time på \nhverdag mellom kl. 07- 18","Mindre enn 400 meter til kollektivholdeplass \nmed minst 2 avganger per time på \nhverdag mellom kl. 07-18. ","Mindre enn 300 meter til kollektivholdeplass \nmed minst 3 avganger per time på \nhverdag mellom kl. 07-18"]
[null,null,"Innovasjonspoeng for grønn mobilitet","Ingen spesielle tiltak","1 innovativ tiltak med bakgrunn i mobilitetsplan","2 innovative tiltak med bakgrunn i mobilitetsplan","3 innovative tiltak med bakgrunn i mobilitetsplan","4 eller flere innovative tiltak med bakgrunn i mobilitetsplan"]
[null,"Gjenbruk og materialvalg","Bygg på bærekraftige og fornybare materialvalg","Prosjektets materialer tilsvarer et standardbygg, på nivå med gjeldende TEK","Prosjektets materialer oppnår minimum 10 % redusert klimagassutslipp sammenlignet med et standardbygg \n(i CO2e/m2 BRA). ","Prosjektets materialer oppnår minimum 20 % redusert klimagassutslipp sammenlignet med et standardbygg \n(i CO2e/m2 BRA). ","Prosjektets materialer oppnår minimum 30 % redusert klimagassutslipp sammenlignet med et standardbygg \n(i CO2e/m2 BRA). ","Prosjektets materialer oppnår minimum 50 % redusert klimagassutslipp sammenlignet med et standardbygg \n(i CO2e/m2 BRA). "]
[null,null,"Sirkulære og fleksible bygg","Ingen tiltak","Et av kriteriene i sjekklisten er utført","Tre av kriteriene i sjekklisten er utført","Fem av kriteriene i sjekklisten er utført","Alle kriteriene i sjekklisten er utført"]
[null,null,"Ombruk av materialer og bevaring av eksisterende bygg","Ingen tiltak for ombruk. Eksisterende bebyggelse rives og materialer behandles som avfall.","Det er gjennomført ombrukskartlegging og gjort en vurdering av ombruk for bygningsmassen.","Minimum 10 % av materialene (målt i vekt) er ombrukte.","Minimum 30 % av materialene (målt i vekt) er ombrukte.","Minimum 50 % av materialene (målt i vekt) er ombrukte."]
{"$rows_left_out":14}